Target
Bcl-2-related protein A1
Ligand
BDBM34190
Substrate
Meas. Tech.
TR-FRET secondary assay for HTS discovery of chemical inhibitors of anti-apoptotic protein Bfl-1
IC50
>100000±0 nM
Citation
 PubChem, PC TR-FRET secondary assay for HTS discovery of chemical inhibitors of anti-apoptotic protein Bfl-1 PubChem Bioassay (2008)[AID] 
Target
Name:
Bcl-2-related protein A1
Synonyms:
A1 B-cell leukemia/lymphoma 2 related protein A1a Bcl2a1 Bfl-1 Hemopoietic-specific early response protein | Protein BFL-1
Type:
Apoptosis regulator protein
Mol. Mass.:
19909.74
Organism:
Mus musculus (Mouse)
Description:
gi_11024684
Residue:
172
  
Inhibitor
Name:
BDBM34190
Synonyms:
3-(5-phenyl-7-thiophen-2-yl-1,7-dihydro-[1,2,4]triazolo[1,5-a]pyrimidin-2-yl)-1-propanol 3-[5-phenyl-7-(2-thienyl)-1,7-dihydro-[1,2,4]triazolo[1,5-a]pyrimidin-2-yl]propan-1-ol SMR000018755 | cid_5310167
Type:
Small organic molecule
Emp. Form.:
C18H18N4OS
Mol. Mass.:
338.427
SMILES:
OCCCc1nc2N=C(CC(c3cccs3)n2n1)c1ccccc1
: