Target
Bcl-2-related protein A1
Ligand
BDBM39122
Substrate
Meas. Tech.
TR-FRET secondary assay for HTS discovery of chemical inhibitors of anti-apoptotic protein Bfl-1
IC50
4960±400 nM
Citation
 PubChem, PC TR-FRET secondary assay for HTS discovery of chemical inhibitors of anti-apoptotic protein Bfl-1 PubChem Bioassay (2008)[AID] 
Target
Name:
Bcl-2-related protein A1
Synonyms:
A1 B-cell leukemia/lymphoma 2 related protein A1a Bcl2a1 Bfl-1 Hemopoietic-specific early response protein | Protein BFL-1
Type:
Apoptosis regulator protein
Mol. Mass.:
19909.74
Organism:
Mus musculus (Mouse)
Description:
gi_11024684
Residue:
172
  
Inhibitor
Name:
BDBM39122
Synonyms:
3-chloranyl-1-(3,4-dichlorophenyl)-4-(2-methoxyethylamino)pyrrole-2,5-dione 3-chloro-1-(3,4-dichlorophenyl)-4-(2-methoxyethylamino)pyrrole-2,5-dione cid_16654626
Type:
Small organic molecule
Emp. Form.:
C13H11Cl3N2O3
Mol. Mass.:
349.597
SMILES:
COCC=Nc1c(Cl)c(O)n(c1O)-c1ccc(Cl)c(Cl)c1
: