Target
Bcl-2-related protein A1
Ligand
BDBM39123
Substrate
Meas. Tech.
TR-FRET secondary assay for HTS discovery of chemical inhibitors of anti-apoptotic protein Bfl-1
IC50
770±80 nM
Citation
 PubChem, PC TR-FRET secondary assay for HTS discovery of chemical inhibitors of anti-apoptotic protein Bfl-1 PubChem Bioassay (2008)[AID] 
Target
Name:
Bcl-2-related protein A1
Synonyms:
A1 B-cell leukemia/lymphoma 2 related protein A1a Bcl2a1 Bfl-1 Hemopoietic-specific early response protein | Protein BFL-1
Type:
Apoptosis regulator protein
Mol. Mass.:
19909.74
Organism:
Mus musculus (Mouse)
Description:
gi_11024684
Residue:
172
  
Inhibitor
Name:
BDBM39123
Synonyms:
3,4-bis(chloranyl)-1-(3,4-dichlorophenyl)pyrrole-2,5-dione 3,4-dichloro-1-(3,4-dichlorophenyl)pyrrole-2,5-dione cid_300953
Type:
Small organic molecule
Emp. Form.:
C10H3Cl4NO2
Mol. Mass.:
310.948
SMILES:
ClC1=C(Cl)C(=O)N(C1=O)c1ccc(Cl)c(Cl)c1
: