Target
Bcl-2-related protein A1
Ligand
BDBM39174
Substrate
Meas. Tech.
TR-FRET secondary assay for HTS discovery of chemical inhibitors of anti-apoptotic protein Bfl-1
IC50
3510±380 nM
Citation
 PubChem, PC TR-FRET secondary assay for HTS discovery of chemical inhibitors of anti-apoptotic protein Bfl-1 PubChem Bioassay (2008)[AID] 
Target
Name:
Bcl-2-related protein A1
Synonyms:
A1 B-cell leukemia/lymphoma 2 related protein A1a Bcl2a1 Bfl-1 Hemopoietic-specific early response protein | Protein BFL-1
Type:
Apoptosis regulator protein
Mol. Mass.:
19909.74
Organism:
Mus musculus (Mouse)
Description:
gi_11024684
Residue:
172
  
Inhibitor
Name:
BDBM39174
Synonyms:
3-chloranyl-4-[4-[2-(2-hydroxyethyloxy)ethyl]piperazin-1-yl]-1-(4-nitrophenyl)pyrrole-2,5-dione 3-chloro-4-[4-[2-(2-hydroxyethoxy)ethyl]piperazin-1-yl]-1-(4-nitrophenyl)pyrrole-2,5-dione MLS-0111731.0001 | cid_16654760
Type:
Small organic molecule
Emp. Form.:
C18H21ClN4O6
Mol. Mass.:
424.836
SMILES:
OCCOCCN1CCN(CC1)C1=C(Cl)C(=O)N(C1=O)c1ccc(cc1)[N+]([O-])=O
: