Target
Rho-associated protein kinase 2
Ligand
BDBM39190
Substrate
Meas. Tech.
Dose-response biochemical assay of inhibitors of Rho kinase 2 (Rock2)
IC50
3520±n/a nM
Citation
 PubChem, PC Dose-response biochemical assay of inhibitors of Rho kinase 2 (Rock2)  PubChem Bioassay (2007)[AID] 
Target
Name:
Rho-associated protein kinase 2
Synonyms:
KIAA0619 ROCK2 Rho kinase 2 (ROCKII) Rho-associated protein kinase 2 (ROCK2) Rho-associated protein kinase 2/Transforming protein RhoA Rho-associated, coiled-coil-containing protein kinase II p164 ROCK-2
Type:
Protein
Mol. Mass.:
160885.43
Organism:
Homo sapiens (Human)
Description:
O75116
Residue:
1388
  
Inhibitor
Name:
BDBM39190
Synonyms:
Furan-2-carboxylic acid (3-{2-[1-(3-acetyl-phenyl)-1H-tetrazol-5-ylsulfanyl]-acetylamino}-phenyl)-amide N-[3-[2-[[1-(3-ethanoylphenyl)-1,2,3,4-tetrazol-5-yl]sulfanyl]ethanoylamino]phenyl]furan-2-carboxamide N-[3-[[2-[[1-(3-acetylphenyl)-5-tetrazolyl]thio]-1-oxoethyl]amino]phenyl]-2-furancarboxamide SMR000005666 | cid_647010
Type:
Small organic molecule
Emp. Form.:
C22H18N6O4S
Mol. Mass.:
462.481
SMILES:
CC(=O)c1cccc(c1)-n1nnnc1SCC(=O)Nc1cccc(NC(=O)c2ccco2)c1
: