Target
Rho-associated protein kinase 2
Ligand
BDBM37876
Substrate
Meas. Tech.
Dose-response biochemical assay of inhibitors of Rho kinase 2 (Rock2)
IC50
6834±n/a nM
Citation
 PubChem, PC Dose-response biochemical assay of inhibitors of Rho kinase 2 (Rock2)  PubChem Bioassay (2007)[AID] 
Target
Name:
Rho-associated protein kinase 2
Synonyms:
KIAA0619 ROCK2 Rho kinase 2 (ROCKII) Rho-associated protein kinase 2 (ROCK2) Rho-associated protein kinase 2/Transforming protein RhoA Rho-associated, coiled-coil-containing protein kinase II p164 ROCK-2
Type:
Protein
Mol. Mass.:
160885.43
Organism:
Homo sapiens (Human)
Description:
O75116
Residue:
1388
  
Inhibitor
Name:
BDBM37876
Synonyms:
3-Chloro-6-methoxy-benzo[b]thiophene-2-carboxylic acid amide 3-chloro-6-methoxy-1-benzothiophene-2-carboxamide MLS000075717 cid_652152
Type:
Small organic molecule
Emp. Form.:
C10H8ClNO2S
Mol. Mass.:
241.694
SMILES:
COc1ccc2c(Cl)c(sc2c1)C(N)=O
: