Target
Rho-associated protein kinase 2
Ligand
BDBM37898
Substrate
Meas. Tech.
Dose-response biochemical assay of inhibitors of Rho kinase 2 (Rock2)
IC50
5977±n/a nM
Citation
 PubChem, PC Dose-response biochemical assay of inhibitors of Rho kinase 2 (Rock2)  PubChem Bioassay (2007)[AID] 
Target
Name:
Rho-associated protein kinase 2
Synonyms:
KIAA0619 ROCK2 Rho kinase 2 (ROCKII) Rho-associated protein kinase 2 (ROCK2) Rho-associated protein kinase 2/Transforming protein RhoA Rho-associated, coiled-coil-containing protein kinase II p164 ROCK-2
Type:
Protein
Mol. Mass.:
160885.43
Organism:
Homo sapiens (Human)
Description:
O75116
Residue:
1388
  
Inhibitor
Name:
BDBM37898
Synonyms:
1-(4-amino-1,2,5-oxadiazol-3-yl)-5-thiophen-2-yl-4-triazolecarboxylic acid ethyl ester MLS000043571 cid_3236615 ethyl 1-(4-amino-1,2,5-oxadiazol-3-yl)-5-thiophen-2-yltriazole-4-carboxylate | ethyl 1-(4-azanyl-1,2,5-oxadiazol-3-yl)-5-thiophen-2-yl-1,2,3-triazole-4-carboxylate
Type:
Small organic molecule
Emp. Form.:
C11H10N6O3S
Mol. Mass.:
306.301
SMILES:
CCOC(=O)c1nnn(-c2nonc2N)c1-c1cccs1
: