Target
Rho-associated protein kinase 2
Ligand
BDBM39242
Substrate
Meas. Tech.
Dose-response biochemical assay of inhibitors of Rho kinase 2 (Rock2)
IC50
5635±n/a nM
Citation
 PubChem, PC Dose-response biochemical assay of inhibitors of Rho kinase 2 (Rock2)  PubChem Bioassay (2007)[AID] 
Target
Name:
Rho-associated protein kinase 2
Synonyms:
KIAA0619 ROCK2 Rho kinase 2 (ROCKII) Rho-associated protein kinase 2 (ROCK2) Rho-associated protein kinase 2/Transforming protein RhoA Rho-associated, coiled-coil-containing protein kinase II p164 ROCK-2
Type:
Protein
Mol. Mass.:
160885.43
Organism:
Homo sapiens (Human)
Description:
O75116
Residue:
1388
  
Inhibitor
Name:
BDBM39242
Synonyms:
2-(morpholin-4-ylmethyl)indeno[1,2,3-de]phthalazin-3(2H)-one SMR000019389 | cid_3241106
Type:
Small organic molecule
Emp. Form.:
C19H17N3O2
Mol. Mass.:
319.3572
SMILES:
O=c1n(CN2CCOCC2)nc2-c3ccccc3-c3cccc1c23
: