Target
Rho-associated protein kinase 2
Ligand
BDBM37244
Substrate
Meas. Tech.
Dose-response biochemical assay of inhibitors of Rho kinase 2 (Rock2)
IC50
1798±n/a nM
Citation
 PubChem, PC Dose-response biochemical assay of inhibitors of Rho kinase 2 (Rock2)  PubChem Bioassay (2007)[AID] 
Target
Name:
Rho-associated protein kinase 2
Synonyms:
KIAA0619 ROCK2 Rho kinase 2 (ROCKII) Rho-associated protein kinase 2 (ROCK2) Rho-associated protein kinase 2/Transforming protein RhoA Rho-associated, coiled-coil-containing protein kinase II p164 ROCK-2
Type:
Protein
Mol. Mass.:
160885.43
Organism:
Homo sapiens (Human)
Description:
O75116
Residue:
1388
  
Inhibitor
Name:
BDBM37244
Synonyms:
2-[(1H-indazol-5-ylamino)methylene]-5,5-dimethyl-cyclohexane-1,3-quinone 2-[(1H-indazol-5-ylamino)methylidene]-5,5-dimethylcyclohexane-1,3-dione SMR000111453 | cid_870804
Type:
Small organic molecule
Emp. Form.:
C16H17N3O2
Mol. Mass.:
283.3251
SMILES:
CC1(C)CC(=O)C(=CNc2ccc3[nH]ncc3c2)C(=O)C1
: