Target
Rho-associated protein kinase 2
Ligand
BDBM39322
Substrate
Meas. Tech.
Dose-response biochemical assay of inhibitors of Rho kinase 2 (Rock2)
IC50
2204±n/a nM
Citation
 PubChem, PC Dose-response biochemical assay of inhibitors of Rho kinase 2 (Rock2)  PubChem Bioassay (2007)[AID] 
Target
Name:
Rho-associated protein kinase 2
Synonyms:
KIAA0619 ROCK2 Rho kinase 2 (ROCKII) Rho-associated protein kinase 2 (ROCK2) Rho-associated protein kinase 2/Transforming protein RhoA Rho-associated, coiled-coil-containing protein kinase II p164 ROCK-2
Type:
Protein
Mol. Mass.:
160885.43
Organism:
Homo sapiens (Human)
Description:
O75116
Residue:
1388
  
Inhibitor
Name:
BDBM39322
Synonyms:
2-chloranyl-N-(4-hydroxyphenyl)-5-pyrrolidin-1-ylsulfonyl-benzamide 2-chloro-N-(4-hydroxyphenyl)-5-pyrrolidin-1-ylsulfonylbenzamide MLS000111568 cid_1316845
Type:
Small organic molecule
Emp. Form.:
C17H17ClN2O4S
Mol. Mass.:
380.846
SMILES:
Oc1ccc(NC(=O)c2cc(ccc2Cl)S(=O)(=O)N2CCCC2)cc1
: