Target
Genome polyprotein
Ligand
BDBM37631
Substrate
Meas. Tech.
West Nile Virus NS2bNS3 Proteinase Inhibitor Dose Response Confirmation.
IC50
>50000±n/a nM
Citation
 PubChem, PC West Nile Virus NS2bNS3 Proteinase Inhibitor Dose Response Confirmation. PubChem Bioassay (2007)[AID] 
Target
Name:
Genome polyprotein
Synonyms:
POLG_WNV | polyprotein precursor
Type:
PROTEIN
Mol. Mass.:
380170.63
Organism:
West Nile virus
Description:
ChEMBL_1438217
Residue:
3430
  
Inhibitor
Name:
BDBM37631
Synonyms:
ALTRETAMINE SMR000058181 | cid_2123
Type:
Small organic molecule
Emp. Form.:
C9H18N6
Mol. Mass.:
210.2794
SMILES:
CN(C)c1nc(nc(n1)N(C)C)N(C)C
: