Target
Genome polyprotein
Ligand
BDBM18957
Substrate
Meas. Tech.
West Nile Virus NS2bNS3 Proteinase Inhibitor Dose Response Confirmation.
IC50
>50000±n/a nM
Citation
 PubChem, PC West Nile Virus NS2bNS3 Proteinase Inhibitor Dose Response Confirmation. PubChem Bioassay (2007)[AID] 
Target
Name:
Genome polyprotein
Synonyms:
POLG_WNV | polyprotein precursor
Type:
PROTEIN
Mol. Mass.:
380170.63
Organism:
West Nile virus
Description:
ChEMBL_1438217
Residue:
3430
  
Inhibitor
Name:
BDBM18957
Synonyms:
(2-{4-[(2-butyl-1-benzofuran-3-yl)carbonyl]-2,6-diiodophenoxy}ethyl)diethylamine Amiodarone Cordarone cid_441325
Type:
Small organic molecule
Emp. Form.:
C25H29I2NO3
Mol. Mass.:
645.3116
SMILES:
CCCCc1oc2ccccc2c1C(=O)c1cc(I)c(OCCN(CC)CC)c(I)c1
: