Target
Genome polyprotein
Ligand
BDBM39345
Substrate
Meas. Tech.
West Nile Virus NS2bNS3 Proteinase Inhibitor Dose Response Confirmation.
IC50
>50000±n/a nM
Citation
 PubChem, PC West Nile Virus NS2bNS3 Proteinase Inhibitor Dose Response Confirmation. PubChem Bioassay (2007)[AID] 
Target
Name:
Genome polyprotein
Synonyms:
POLG_WNV | polyprotein precursor
Type:
PROTEIN
Mol. Mass.:
380170.63
Organism:
West Nile virus
Description:
ChEMBL_1438217
Residue:
3430
  
Inhibitor
Name:
BDBM39345
Synonyms:
5,5-DIPHENYLHYDANTOIN SODIUM SALT SMR000058987 sodium;5,5-diphenylimidazolidin-3-ide-2,4-dione | sodium;5,5-diphenylimidazolidin-3-ide-2,4-quinone
Type:
Small organic molecule
Emp. Form.:
C15H11N2O2
Mol. Mass.:
251.2606
SMILES:
O=C1NC(C(=O)[N-]1)(c1ccccc1)c1ccccc1
: