Target
Genome polyprotein
Ligand
BDBM39354
Substrate
Meas. Tech.
West Nile Virus NS2bNS3 Proteinase Inhibitor Dose Response Confirmation.
IC50
>50000±n/a nM
Citation
 PubChem, PC West Nile Virus NS2bNS3 Proteinase Inhibitor Dose Response Confirmation. PubChem Bioassay (2007)[AID] 
Target
Name:
Genome polyprotein
Synonyms:
POLG_WNV | polyprotein precursor
Type:
PROTEIN
Mol. Mass.:
380170.63
Organism:
West Nile virus
Description:
ChEMBL_1438217
Residue:
3430
  
Inhibitor
Name:
BDBM39354
Synonyms:
2,2,4-trimethyl-6-oxidanylidene-3H-pyran-5-carbonitrile 6-keto-2,2,4-trimethyl-3H-pyran-5-carbonitrile SMR000037070 | cid_572006
Type:
Small organic molecule
Emp. Form.:
C9H11NO2
Mol. Mass.:
165.1891
SMILES:
CC1=C(C#N)C(=O)OC(C)(C)C1
: