Target
Genome polyprotein
Ligand
BDBM39355
Substrate
Meas. Tech.
West Nile Virus NS2bNS3 Proteinase Inhibitor Dose Response Confirmation.
IC50
>50000±n/a nM
Citation
 PubChem, PC West Nile Virus NS2bNS3 Proteinase Inhibitor Dose Response Confirmation. PubChem Bioassay (2007)[AID] 
Target
Name:
Genome polyprotein
Synonyms:
POLG_WNV | polyprotein precursor
Type:
PROTEIN
Mol. Mass.:
380170.63
Organism:
West Nile virus
Description:
ChEMBL_1438217
Residue:
3430
  
Inhibitor
Name:
BDBM39355
Synonyms:
1-phenoxy-3-(3-piperidin-1-ylpropylamino)propan-2-ol;hydrochloride 1-phenoxy-3-[3-(1-piperidinyl)propylamino]-2-propanol;hydrochloride SMR000038517 | cid_6603061
Type:
Small organic molecule
Emp. Form.:
C17H28N2O2
Mol. Mass.:
292.4164
SMILES:
OC(CNCCCN1CCCCC1)COc1ccccc1
: