Target
Genome polyprotein
Ligand
BDBM39366
Substrate
Meas. Tech.
West Nile Virus NS2bNS3 Proteinase Inhibitor Dose Response Confirmation.
IC50
>50000±n/a nM
Citation
 PubChem, PC West Nile Virus NS2bNS3 Proteinase Inhibitor Dose Response Confirmation. PubChem Bioassay (2007)[AID] 
Target
Name:
Genome polyprotein
Synonyms:
POLG_WNV | polyprotein precursor
Type:
PROTEIN
Mol. Mass.:
380170.63
Organism:
West Nile virus
Description:
ChEMBL_1438217
Residue:
3430
  
Inhibitor
Name:
BDBM39366
Synonyms:
4-[5-[(4-fluorobenzyl)thio]tetrazol-1-yl]benzamide 4-[5-[(4-fluorophenyl)methylsulfanyl]tetrazol-1-yl]benzamide MLS000037669 cid_661053
Type:
Small organic molecule
Emp. Form.:
C15H12FN5OS
Mol. Mass.:
329.352
SMILES:
NC(=O)c1ccc(cc1)-n1nnnc1SCc1ccc(F)cc1
: