Target
Genome polyprotein
Ligand
BDBM39375
Substrate
Meas. Tech.
West Nile Virus NS2bNS3 Proteinase Inhibitor Dose Response Confirmation.
IC50
>50000±n/a nM
Citation
 PubChem, PC West Nile Virus NS2bNS3 Proteinase Inhibitor Dose Response Confirmation. PubChem Bioassay (2007)[AID] 
Target
Name:
Genome polyprotein
Synonyms:
POLG_WNV | polyprotein precursor
Type:
PROTEIN
Mol. Mass.:
380170.63
Organism:
West Nile virus
Description:
ChEMBL_1438217
Residue:
3430
  
Inhibitor
Name:
BDBM39375
Synonyms:
MLS000040750 cid_664589
Type:
Small organic molecule
Emp. Form.:
C27H25N5O4
Mol. Mass.:
483.5185
SMILES:
COc1ccc(cc1OC)C1C2=C(CC(C)(C)CC2=O)Oc2ncn3nc(nc3c12)-c1cccnc1
: