Target
Genome polyprotein
Ligand
BDBM39390
Substrate
Meas. Tech.
West Nile Virus NS2bNS3 Proteinase Inhibitor Dose Response Confirmation.
IC50
>50000±n/a nM
Citation
 PubChem, PC West Nile Virus NS2bNS3 Proteinase Inhibitor Dose Response Confirmation. PubChem Bioassay (2007)[AID] 
Target
Name:
Genome polyprotein
Synonyms:
POLG_WNV | polyprotein precursor
Type:
PROTEIN
Mol. Mass.:
380170.63
Organism:
West Nile virus
Description:
ChEMBL_1438217
Residue:
3430
  
Inhibitor
Name:
BDBM39390
Synonyms:
1-(2-furoyl)-4-(thien-2-ylcarbonyl)-2,3,4,5-tetrahydro-1H-1,4-benzodiazepine 2-furyl-[4-(2-thenoyl)-3,5-dihydro-2H-1,4-benzodiazepin-1-yl]methanone SMR000033243 furan-2-yl-(4-thiophen-2-ylcarbonyl-3,5-dihydro-2H-1,4-benzodiazepin-1-yl)methanone | furan-2-yl-[4-(thiophene-2-carbonyl)-3,5-dihydro-2H-1,4-benzodiazepin-1-yl]methanone
Type:
Small organic molecule
Emp. Form.:
C19H16N2O3S
Mol. Mass.:
352.407
SMILES:
O=C(N1CCN(Cc2ccccc12)C(=O)c1cccs1)c1ccco1
: