Target
Genome polyprotein
Ligand
BDBM39407
Substrate
Meas. Tech.
West Nile Virus NS2bNS3 Proteinase Inhibitor Dose Response Confirmation.
IC50
>50000±n/a nM
Citation
 PubChem, PC West Nile Virus NS2bNS3 Proteinase Inhibitor Dose Response Confirmation. PubChem Bioassay (2007)[AID] 
Target
Name:
Genome polyprotein
Synonyms:
POLG_WNV | polyprotein precursor
Type:
PROTEIN
Mol. Mass.:
380170.63
Organism:
West Nile virus
Description:
ChEMBL_1438217
Residue:
3430
  
Inhibitor
Name:
BDBM39407
Synonyms:
MLS000058902 N-benzyl-N-ethyl-2-methylbenzamide SMR000069471 | cid_576969
Type:
Small organic molecule
Emp. Form.:
C17H19NO
Mol. Mass.:
253.3389
SMILES:
CCN(Cc1ccccc1)C(=O)c1ccccc1C
: