Target
Genome polyprotein
Ligand
BDBM39410
Substrate
Meas. Tech.
West Nile Virus NS2bNS3 Proteinase Inhibitor Dose Response Confirmation.
IC50
>50000±n/a nM
Citation
 PubChem, PC West Nile Virus NS2bNS3 Proteinase Inhibitor Dose Response Confirmation. PubChem Bioassay (2007)[AID] 
Target
Name:
Genome polyprotein
Synonyms:
POLG_WNV | polyprotein precursor
Type:
PROTEIN
Mol. Mass.:
380170.63
Organism:
West Nile virus
Description:
ChEMBL_1438217
Residue:
3430
  
Inhibitor
Name:
BDBM39410
Synonyms:
(6-chloro-2,3,4,9-tetrahydro-1H-carbazol-1-yl)urea MLS000114269 cid_2883009
Type:
Small organic molecule
Emp. Form.:
C13H14ClN3O
Mol. Mass.:
263.723
SMILES:
NC(=O)NC1CCCc2c1[nH]c1ccc(Cl)cc21
: