Target
M-phase inducer phosphatase 2
Ligand
BDBM32061
Substrate
Meas. Tech.
Cdc25B Catalytic Domain Protein Tyrosine Phosphatase Probe Assessment Dose Response assay in the presence of Catalase.
IC50
>50000±n/a nM
Citation
 PubChem, PC Cdc25B Catalytic Domain Protein Tyrosine Phosphatase Probe Assessment Dose Response assay in the presence of Catalase. PubChem Bioassay (2007)[AID] 
Target
Name:
M-phase inducer phosphatase 2
Synonyms:
CDC25B Dual specificity phosphatase (CDC25B) M-phase inducer phosphatase 2 (CDC25B) | MPIP2_HUMAN
Type:
Protein
Mol. Mass.:
64985.27
Organism:
Homo sapiens (Human)
Description:
Residue:
580
  
Inhibitor
Name:
BDBM32061
Synonyms:
1,8-bis(azanyl)-3,6-dipyrrolidin-1-yl-2,7-naphthyridine-4-carbonitrile 1,8-diamino-3,6-dipyrrolidin-1-yl-2,7-naphthyridine-4-carbonitrile MLS000054131 cid_2997948
Type:
Small organic molecule
Emp. Form.:
C17H21N7
Mol. Mass.:
323.3955
SMILES:
Nc1nc(cc2c(C#N)c(nc(N)c12)N1CCCC1)N1CCCC1
: