Target
M-phase inducer phosphatase 2
Ligand
BDBM32062
Substrate
Meas. Tech.
Cdc25B Catalytic Domain Protein Tyrosine Phosphatase Probe Assessment Dose Response assay in the presence of Catalase.
IC50
23582±n/a nM
Citation
 PubChem, PC Cdc25B Catalytic Domain Protein Tyrosine Phosphatase Probe Assessment Dose Response assay in the presence of Catalase. PubChem Bioassay (2007)[AID] 
Target
Name:
M-phase inducer phosphatase 2
Synonyms:
CDC25B Dual specificity phosphatase (CDC25B) M-phase inducer phosphatase 2 (CDC25B) | MPIP2_HUMAN
Type:
Protein
Mol. Mass.:
64985.27
Organism:
Homo sapiens (Human)
Description:
Residue:
580
  
Inhibitor
Name:
BDBM32062
Synonyms:
MLS000054842 N-(1-butyl-3-cyano-pyrrolo[3,2-b]quinoxalin-2-yl)benzamide SMR000060333 US9073941, 1003 | cid_1910302
Type:
Small organic molecule
Emp. Form.:
C22H19N5O
Mol. Mass.:
369.4192
SMILES:
CCCCn1c(NC(=O)c2ccccc2)c(C#N)c2nc3ccccc3nc12
: