Target
M-phase inducer phosphatase 2
Ligand
BDBM35380
Substrate
Meas. Tech.
Cdc25B Catalytic Domain Protein Tyrosine Phosphatase Probe Assessment Dose Response assay in 25 mM DTT and Catalase.
IC50
>50000±n/a nM
Citation
 PubChem, PC Cdc25B Catalytic Domain Protein Tyrosine Phosphatase Probe Assessment Dose Response assay in 25 mM DTT and Catalase. PubChem Bioassay (2007)[AID] 
Target
Name:
M-phase inducer phosphatase 2
Synonyms:
CDC25B Dual specificity phosphatase (CDC25B) M-phase inducer phosphatase 2 (CDC25B) | MPIP2_HUMAN
Type:
Protein
Mol. Mass.:
64985.27
Organism:
Homo sapiens (Human)
Description:
Residue:
580
  
Inhibitor
Name:
BDBM35380
Synonyms:
MLS000096457 N-phenyl-1-pyridin-4-yl-methanimine oxide SMR000062185 | cid_768563
Type:
Small organic molecule
Emp. Form.:
C12H10N2O
Mol. Mass.:
198.2206
SMILES:
[O-]\[N+](=C/c1ccncc1)c1ccccc1
: