Target
M-phase inducer phosphatase 2
Ligand
BDBM31704
Substrate
Meas. Tech.
Cdc25B Catalytic Domain Protein Tyrosine Phosphatase Probe Assessment Dose Response assay in 25 mM DTT and Catalase.
IC50
40874.00055±n/a nM
Citation
 PubChem, PC Cdc25B Catalytic Domain Protein Tyrosine Phosphatase Probe Assessment Dose Response assay in 25 mM DTT and Catalase. PubChem Bioassay (2007)[AID] 
Target
Name:
M-phase inducer phosphatase 2
Synonyms:
CDC25B Dual specificity phosphatase (CDC25B) M-phase inducer phosphatase 2 (CDC25B) | MPIP2_HUMAN
Type:
Protein
Mol. Mass.:
64985.27
Organism:
Homo sapiens (Human)
Description:
Residue:
580
  
Inhibitor
Name:
BDBM31704
Synonyms:
MLS000050353 N-[2,3-bis(2-furanyl)-6-quinoxalinyl]-1-azepanecarboxamide N-[2,3-bis(furan-2-yl)quinoxalin-6-yl]azepane-1-carboxamide cid_2214811
Type:
Small organic molecule
Emp. Form.:
C23H22N4O3
Mol. Mass.:
402.4458
SMILES:
O=C(Nc1ccc2nc(-c3ccco3)c(nc2c1)-c1ccco1)N1CCCCCC1
: