Target
M-phase inducer phosphatase 2
Ligand
BDBM35436
Substrate
Meas. Tech.
Cdc25B Catalytic Domain Protein Tyrosine Phosphatase Probe Assessment Dose Response assay in 25 mM DTT and Catalase.
IC50
>50000±n/a nM
Citation
 PubChem, PC Cdc25B Catalytic Domain Protein Tyrosine Phosphatase Probe Assessment Dose Response assay in 25 mM DTT and Catalase. PubChem Bioassay (2007)[AID] 
Target
Name:
M-phase inducer phosphatase 2
Synonyms:
CDC25B Dual specificity phosphatase (CDC25B) M-phase inducer phosphatase 2 (CDC25B) | MPIP2_HUMAN
Type:
Protein
Mol. Mass.:
64985.27
Organism:
Homo sapiens (Human)
Description:
Residue:
580
  
Inhibitor
Name:
BDBM35436
Synonyms:
1-[4-(difluoromethoxy)phenyl]-N-phenyl-methanimine oxide 1-[4-[bis(fluoranyl)methoxy]phenyl]-N-phenyl-methanimine oxide SMR000107639 | cid_702440
Type:
Small organic molecule
Emp. Form.:
C14H11F2NO2
Mol. Mass.:
263.2394
SMILES:
[O-]\[N+](=C/c1ccc(OC(F)F)cc1)c1ccccc1
: