Target
M-phase inducer phosphatase 2
Ligand
BDBM31044
Substrate
Meas. Tech.
Cdc25B Catalytic Domain Protein Tyrosine Phosphatase Probe Assessment Dose Response assay in the presence of Glutathione.
IC50
>50000±n/a nM
Citation
 PubChem, PC Cdc25B Catalytic Domain Protein Tyrosine Phosphatase Probe Assessment Dose Response assay in the presence of Glutathione. PubChem Bioassay (2007)[AID] 
Target
Name:
M-phase inducer phosphatase 2
Synonyms:
CDC25B Dual specificity phosphatase (CDC25B) M-phase inducer phosphatase 2 (CDC25B) | MPIP2_HUMAN
Type:
Protein
Mol. Mass.:
64985.27
Organism:
Homo sapiens (Human)
Description:
Residue:
580
  
Inhibitor
Name:
BDBM31044
Synonyms:
1-Ethyl-6-methyl-3-thiophen-2-yl-1H-pyrimido[5,4-e][1,2,4]triazine-5,7-dione 1-ethyl-6-methyl-3-thiophen-2-yl-pyrimido[5,4-e][1,2,4]triazine-5,7-dione MLS000033110 US9073941, 610 | cid_653297
Type:
Small organic molecule
Emp. Form.:
C12H11N5O2S
Mol. Mass.:
289.313
SMILES:
CCn1nc(nc2c1nc(=O)n(C)c2=O)-c1cccs1
: