Target
M-phase inducer phosphatase 2
Ligand
BDBM22851
Substrate
Meas. Tech.
Cdc25B Catalytic Domain Protein Tyrosine Phosphatase Probe Assessment Dose Response assay in the presence of Glutathione.
IC50
24974±n/a nM
Citation
 PubChem, PC Cdc25B Catalytic Domain Protein Tyrosine Phosphatase Probe Assessment Dose Response assay in the presence of Glutathione. PubChem Bioassay (2007)[AID] 
Target
Name:
M-phase inducer phosphatase 2
Synonyms:
CDC25B Dual specificity phosphatase (CDC25B) M-phase inducer phosphatase 2 (CDC25B) | MPIP2_HUMAN
Type:
Protein
Mol. Mass.:
64985.27
Organism:
Homo sapiens (Human)
Description:
Residue:
580
  
Inhibitor
Name:
BDBM22851
Synonyms:
1,2-Dione-Based Compound, 8 1,2-naphthoquinone cid_10667
Type:
Small organic molecule
Emp. Form.:
C10H6O2
Mol. Mass.:
158.1534
SMILES:
O=C1C=Cc2ccccc2C1=O
: