Target
Dual specificity protein phosphatase 6
Ligand
BDBM31040
Substrate
Meas. Tech.
Cdc25B Catalytic Domain Protein Tyrosine Phosphatase Probe Assessment: MKP-3 Dose Response Selectivity comparison.
IC50
615±n/a nM
Citation
 PubChem, PC Cdc25B Catalytic Domain Protein Tyrosine Phosphatase Probe Assessment: MKP-3 Dose Response Selectivity comparison. PubChem Bioassay (2007)[AID] 
Target
Name:
Dual specificity protein phosphatase 6
Synonyms:
DUS6_RAT MAP kinase phosphatase 3 Mitogen-activated protein kinase phosphatase 3 | Mkp3
Type:
Enzyme
Mol. Mass.:
42303.19
Organism:
Rattus norvegicus
Description:
gi_16758752
Residue:
381
  
Inhibitor
Name:
BDBM31040
Synonyms:
1-Ethyl-6-methyl-3-phenyl-1H-pyrimido[5,4-e][1,2,4]triazine-5,7-dione 1-ethyl-6-methyl-3-phenyl-pyrimido[5,4-e][1,2,4]triazine-5,7-quinone MLS000027832 US9073941, 602 | cid_647501
Type:
Small organic molecule
Emp. Form.:
C14H13N5O2
Mol. Mass.:
283.2853
SMILES:
CCn1nc(nc2c1nc(=O)n(C)c2=O)-c1ccccc1
: