Target
Dual specificity protein phosphatase 1
Ligand
BDBM38797
Substrate
Meas. Tech.
Cdc25B Catalytic Domain Protein Tyrosine Phosphatase Probe Assessment: MKP-1 Dose Response Selectivity comparison.
IC50
>50000±n/a nM
Citation
 PubChem, PC Cdc25B Catalytic Domain Protein Tyrosine Phosphatase Probe Assessment: MKP-1 Dose Response Selectivity comparison. PubChem Bioassay (2007)[AID] 
Target
Name:
Dual specificity protein phosphatase 1
Synonyms:
CL100 DUSP1 MAP kinase phosphatase 1 MKP1 Protein-tyrosine phosphatase CL100 | VH1
Type:
Protein phosphatase
Mol. Mass.:
39301.48
Organism:
Homo sapiens (Human)
Description:
gi_4758204
Residue:
367
  
Inhibitor
Name:
BDBM38797
Synonyms:
7-methoxy-3-methyl-1H-indole-2-carboxylic acid SMR000013451 | cid_649614
Type:
Small organic molecule
Emp. Form.:
C11H11NO3
Mol. Mass.:
205.2099
SMILES:
COc1cccc2c(C)c([nH]c12)C(O)=O
: