Target
Dual specificity protein phosphatase 1
Ligand
BDBM35436
Substrate
Meas. Tech.
Cdc25B Catalytic Domain Protein Tyrosine Phosphatase Probe Assessment: MKP-1 Dose Response Selectivity comparison.
IC50
>50000±n/a nM
Citation
 PubChem, PC Cdc25B Catalytic Domain Protein Tyrosine Phosphatase Probe Assessment: MKP-1 Dose Response Selectivity comparison. PubChem Bioassay (2007)[AID] 
Target
Name:
Dual specificity protein phosphatase 1
Synonyms:
CL100 DUSP1 MAP kinase phosphatase 1 MKP1 Protein-tyrosine phosphatase CL100 | VH1
Type:
Protein phosphatase
Mol. Mass.:
39301.48
Organism:
Homo sapiens (Human)
Description:
gi_4758204
Residue:
367
  
Inhibitor
Name:
BDBM35436
Synonyms:
1-[4-(difluoromethoxy)phenyl]-N-phenyl-methanimine oxide 1-[4-[bis(fluoranyl)methoxy]phenyl]-N-phenyl-methanimine oxide SMR000107639 | cid_702440
Type:
Small organic molecule
Emp. Form.:
C14H11F2NO2
Mol. Mass.:
263.2394
SMILES:
[O-]\[N+](=C/c1ccc(OC(F)F)cc1)c1ccccc1
: