Target
Isoform 2 of Nuclear receptor ROR-alpha (Alpha-2)
Ligand
BDBM39447
Substrate
Meas. Tech.
Counterscreen for activators of the nuclear receptor Steroidogenic Factor 1 (SF-1): A cell-based dose-response assay for inhibition of the RAR-related orphan receptor A (RORA)
EC50
2291±n/a nM
Citation
 PubChem, PC Counterscreen for activators of the nuclear receptor Steroidogenic Factor 1 (SF-1): A cell-based dose-response assay for inhibition of the RAR-related orphan receptor A (RORA) PubChem Bioassay (2007)[AID] 
Target
Name:
Isoform 2 of Nuclear receptor ROR-alpha (Alpha-2)
Synonyms:
NR1F1 Nuclear receptor ROR-alpha (Alpha-2) RORA RZRA
Type:
PROTEIN
Mol. Mass.:
63033.59
Organism:
Homo sapiens (Human)
Description:
EBI_101591
Residue:
556
  
Inhibitor
Name:
BDBM39447
Synonyms:
1-(4-chlorophenyl)-N-(2-pyridinylmethyl)-4-pyrazolo[3,4-d]pyrimidinamine MLS000077468 [1-(4-chlorophenyl)pyrazolo[3,4-d]pyrimidin-4-yl]-(2-pyridylmethyl)amine | cid_661011
Type:
Small organic molecule
Emp. Form.:
C17H13ClN6
Mol. Mass.:
336.778
SMILES:
Clc1ccc(cc1)-n1ncc2c(NCc3ccccn3)ncnc12
: