Target
Isoform 2 of Nuclear receptor ROR-alpha (Alpha-2)
Ligand
BDBM39492
Substrate
Meas. Tech.
Counterscreen for activators of the nuclear receptor Steroidogenic Factor 1 (SF-1): A cell-based dose-response assay for inhibition of the RAR-related orphan receptor A (RORA)
EC50
>1222±n/a nM
Citation
 PubChem, PC Counterscreen for activators of the nuclear receptor Steroidogenic Factor 1 (SF-1): A cell-based dose-response assay for inhibition of the RAR-related orphan receptor A (RORA) PubChem Bioassay (2007)[AID] 
Target
Name:
Isoform 2 of Nuclear receptor ROR-alpha (Alpha-2)
Synonyms:
NR1F1 Nuclear receptor ROR-alpha (Alpha-2) RORA RZRA
Type:
PROTEIN
Mol. Mass.:
63033.59
Organism:
Homo sapiens (Human)
Description:
EBI_101591
Residue:
556
  
Inhibitor
Name:
BDBM39492
Synonyms:
2-(1-benzofuran-2-yl)-4a,5,6,7,8,8a-hexahydroquinoxaline 1,4-dioxide 3-(1-benzofuran-2-yl)-4-oxido-4a,5,6,7,8,8a-hexahydroquinoxalin-1-ium 1-oxide 3-(benzofuran-2-yl)-4-oxido-4a,5,6,7,8,8a-hexahydroquinoxalin-1-ium 1-oxide SMR000079285 | cid_2966212
Type:
Small organic molecule
Emp. Form.:
C16H16N2O3
Mol. Mass.:
284.3098
SMILES:
[O-]N1C2CCCCC2[N+](=O)C=C1c1cc2ccccc2o1
: