Target
Isoform 2 of Nuclear receptor ROR-alpha (Alpha-2)
Ligand
BDBM39502
Substrate
Meas. Tech.
Counterscreen for activators of the nuclear receptor Steroidogenic Factor 1 (SF-1): A cell-based dose-response assay for inhibition of the RAR-related orphan receptor A (RORA)
EC50
2532±n/a nM
Citation
 PubChem, PC Counterscreen for activators of the nuclear receptor Steroidogenic Factor 1 (SF-1): A cell-based dose-response assay for inhibition of the RAR-related orphan receptor A (RORA) PubChem Bioassay (2007)[AID] 
Target
Name:
Isoform 2 of Nuclear receptor ROR-alpha (Alpha-2)
Synonyms:
NR1F1 Nuclear receptor ROR-alpha (Alpha-2) RORA RZRA
Type:
PROTEIN
Mol. Mass.:
63033.59
Organism:
Homo sapiens (Human)
Description:
EBI_101591
Residue:
556
  
Inhibitor
Name:
BDBM39502
Synonyms:
MLS000065845 N-(5-tert-butyl-3-isoxazolyl)-2-oxolanecarboxamide N-(5-tert-butylisoxazol-3-yl)tetrahydrofuran-2-carboxamide cid_2970957
Type:
Small organic molecule
Emp. Form.:
C12H18N2O3
Mol. Mass.:
238.2829
SMILES:
CC(C)(C)c1cc(NC(=O)C2CCCO2)no1
: