Target
Isoform 2 of Nuclear receptor ROR-alpha (Alpha-2)
Ligand
BDBM39509
Substrate
Meas. Tech.
Counterscreen for activators of the nuclear receptor Steroidogenic Factor 1 (SF-1): A cell-based dose-response assay for inhibition of the RAR-related orphan receptor A (RORA)
EC50
>99000±n/a nM
Citation
 PubChem, PC Counterscreen for activators of the nuclear receptor Steroidogenic Factor 1 (SF-1): A cell-based dose-response assay for inhibition of the RAR-related orphan receptor A (RORA) PubChem Bioassay (2007)[AID] 
Target
Name:
Isoform 2 of Nuclear receptor ROR-alpha (Alpha-2)
Synonyms:
NR1F1 Nuclear receptor ROR-alpha (Alpha-2) RORA RZRA
Type:
PROTEIN
Mol. Mass.:
63033.59
Organism:
Homo sapiens (Human)
Description:
EBI_101591
Residue:
556
  
Inhibitor
Name:
BDBM39509
Synonyms:
5-bromanyl-N-(4,7-dimethoxy-1,3-benzothiazol-2-yl)thiophene-2-carboxamide 5-bromo-N-(4,7-dimethoxy-1,3-benzothiazol-2-yl)thiophene-2-carboxamide SMR000017682 | cid_2159329
Type:
Small organic molecule
Emp. Form.:
C14H11BrN2O3S2
Mol. Mass.:
399.283
SMILES:
COc1ccc(OC)c2sc(NC(=O)c3ccc(Br)s3)nc12
: