Target
M-phase inducer phosphatase 2
Ligand
BDBM33046
Substrate
Meas. Tech.
MKP-1 Dual Specificity Protein Tyrosine Phosphatase Probe Assessment: Cdc25B Dose Response Selectivity Assay
IC50
46940±n/a nM
Citation
 PubChem, PC MKP-1 Dual Specificity Protein Tyrosine Phosphatase Probe Assessment: Cdc25B Dose Response Selectivity Assay PubChem Bioassay (2007)[AID] 
Target
Name:
M-phase inducer phosphatase 2
Synonyms:
CDC25B Dual specificity phosphatase (CDC25B) M-phase inducer phosphatase 2 (CDC25B) | MPIP2_HUMAN
Type:
Protein
Mol. Mass.:
64985.27
Organism:
Homo sapiens (Human)
Description:
Residue:
580
  
Inhibitor
Name:
BDBM33046
Synonyms:
2-[(5-amino-1H-1,2,4-triazol-3-yl)sulfanyl]-N-[3-cyano-7,7-dimethyl-5-[(E)-2-(5-methylfuran-2-yl)ethenyl]-6H-1-benzothiophen-2-yl]acetamide 2-[(5-amino-1H-1,2,4-triazol-3-yl)thio]-N-[3-cyano-7,7-dimethyl-5-[(E)-2-(5-methyl-2-furyl)vinyl]-6H-benzothiophen-2-yl]acetamide MLS000097571 cid_2079240
Type:
Small organic molecule
Emp. Form.:
C22H22N6O2S2
Mol. Mass.:
466.579
SMILES:
Cc1ccc(\C=C\C2=Cc3c(sc(NC(=O)CSc4nnc(N)[nH]4)c3C#N)C(C)(C)C2)o1
: