Target
M-phase inducer phosphatase 2
Ligand
BDBM33055
Substrate
Meas. Tech.
MKP-1 Dual Specificity Protein Tyrosine Phosphatase Probe Assessment: Cdc25B Dose Response Selectivity Assay
IC50
35564±n/a nM
Citation
 PubChem, PC MKP-1 Dual Specificity Protein Tyrosine Phosphatase Probe Assessment: Cdc25B Dose Response Selectivity Assay PubChem Bioassay (2007)[AID] 
Target
Name:
M-phase inducer phosphatase 2
Synonyms:
CDC25B Dual specificity phosphatase (CDC25B) M-phase inducer phosphatase 2 (CDC25B) | MPIP2_HUMAN
Type:
Protein
Mol. Mass.:
64985.27
Organism:
Homo sapiens (Human)
Description:
Residue:
580
  
Inhibitor
Name:
BDBM33055
Synonyms:
2,3-bis(2-furanyl)-N-phenyl-6-quinoxalinecarboxamide 2,3-bis(furan-2-yl)-N-phenyl-quinoxaline-6-carboxamide 2,3-di-2-furyl-N-phenyl-6-quinoxalinecarboxamide SMR000077343 | cid_2213073
Type:
Small organic molecule
Emp. Form.:
C23H15N3O3
Mol. Mass.:
381.3835
SMILES:
O=C(Nc1ccccc1)c1ccc2nc(-c3ccco3)c(nc2c1)-c1ccco1
: