Target
Coagulation factor XI
Ligand
BDBM32669
Substrate
Meas. Tech.
Factor XIa Dose Response Confirmation
IC50
>50000±0 nM
Citation
 PubChem, PC Factor XIa Dose Response Confirmation PubChem Bioassay (2008)[AID] 
Target
Name:
Coagulation factor XI
Synonyms:
Coagulation factor XIa Coagulation factor XIa light chain FA11_HUMAN Factor XIa PTA | Plasma thromboplastin antecedent
Type:
Enzyme
Mol. Mass.:
70130.58
Organism:
Homo sapiens (Human)
Description:
P03951
Residue:
625
  
Inhibitor
Name:
BDBM32669
Synonyms:
(3,4-dimethoxyphenyl)-[3-(2-furanyl)-5-(methylthio)-1,2,4-triazol-1-yl]methanone (3,4-dimethoxyphenyl)-[3-(furan-2-yl)-5-methylsulfanyl-1,2,4-triazol-1-yl]methanone MLS000049344 cid_976363
Type:
Small organic molecule
Emp. Form.:
C16H15N3O4S
Mol. Mass.:
345.373
SMILES:
COc1ccc(cc1OC)C(=O)n1nc(nc1SC)-c1ccco1
: