Target
Coagulation factor XI
Ligand
BDBM32698
Substrate
Meas. Tech.
Factor XIa Dose Response Confirmation
IC50
6686.42±2354.96 nM
Citation
 PubChem, PC Factor XIa Dose Response Confirmation PubChem Bioassay (2008)[AID] 
Target
Name:
Coagulation factor XI
Synonyms:
Coagulation factor XIa Coagulation factor XIa light chain FA11_HUMAN Factor XIa PTA | Plasma thromboplastin antecedent
Type:
Enzyme
Mol. Mass.:
70130.58
Organism:
Homo sapiens (Human)
Description:
P03951
Residue:
625
  
Inhibitor
Name:
BDBM32698
Synonyms:
2-Acetylamino-3-(1H-indol-3-yl)-propionic acid methyl ester 2-acetamido-3-(1H-indol-3-yl)propionic acid methyl ester SMR000121078 methyl 2-acetamido-3-(1H-indol-3-yl)propanoate
Type:
Small organic molecule
Emp. Form.:
C14H16N2O3
Mol. Mass.:
260.2884
SMILES:
COC(=O)C(Cc1c[nH]c2ccccc12)NC(C)=O
: