Target
Coagulation factor XI
Ligand
BDBM32714
Substrate
Meas. Tech.
Factor XIa Dose Response Confirmation
IC50
>50000±0 nM
Citation
 PubChem, PC Factor XIa Dose Response Confirmation PubChem Bioassay (2008)[AID] 
Target
Name:
Coagulation factor XI
Synonyms:
Coagulation factor XIa Coagulation factor XIa light chain FA11_HUMAN Factor XIa PTA | Plasma thromboplastin antecedent
Type:
Enzyme
Mol. Mass.:
70130.58
Organism:
Homo sapiens (Human)
Description:
P03951
Residue:
625
  
Inhibitor
Name:
BDBM32714
Synonyms:
MLS000520576 N-(4-methylphenyl)-3-pyrrol-1-yl-propanamide N-(p-tolyl)-3-pyrrol-1-yl-propionamide cid_9550240
Type:
Small organic molecule
Emp. Form.:
C14H16N2O
Mol. Mass.:
228.2896
SMILES:
Cc1ccc(NC(=O)CCn2cccc2)cc1
: