Target
Coagulation factor XI
Ligand
BDBM32726
Substrate
Meas. Tech.
Factor XIa Dose Response Confirmation
IC50
>50000±0 nM
Citation
 PubChem, PC Factor XIa Dose Response Confirmation PubChem Bioassay (2008)[AID] 
Target
Name:
Coagulation factor XI
Synonyms:
Coagulation factor XIa Coagulation factor XIa light chain FA11_HUMAN Factor XIa PTA | Plasma thromboplastin antecedent
Type:
Enzyme
Mol. Mass.:
70130.58
Organism:
Homo sapiens (Human)
Description:
P03951
Residue:
625
  
Inhibitor
Name:
BDBM32726
Synonyms:
(4-fluorophenyl)-(4-nicotinoylpiperazino)methanone (4-fluorophenyl)-[4-(pyridine-3-carbonyl)piperazin-1-yl]methanone 1-(4-fluorobenzoyl)-4-(3-pyridinylcarbonyl)piperazine SMR000140978 | cid_776712
Type:
Small organic molecule
Emp. Form.:
C17H16FN3O2
Mol. Mass.:
313.3262
SMILES:
Fc1ccc(cc1)C(=O)N1CCN(CC1)C(=O)c1cccnc1
: