Target
Coagulation factor XI
Ligand
BDBM32732
Substrate
Meas. Tech.
Factor XIa Dose Response Confirmation
IC50
588.113±40.8393 nM
Citation
 PubChem, PC Factor XIa Dose Response Confirmation PubChem Bioassay (2008)[AID] 
Target
Name:
Coagulation factor XI
Synonyms:
Coagulation factor XIa Coagulation factor XIa light chain FA11_HUMAN Factor XIa PTA | Plasma thromboplastin antecedent
Type:
Enzyme
Mol. Mass.:
70130.58
Organism:
Homo sapiens (Human)
Description:
P03951
Residue:
625
  
Inhibitor
Name:
BDBM32732
Synonyms:
MLS000554787 N-(5-ethyl-3-bicyclo[2.2.1]heptanyl)ethanamide N-(6-ethylnorbornan-2-yl)acetamide cid_4896559
Type:
Small organic molecule
Emp. Form.:
C11H19NO
Mol. Mass.:
181.2747
SMILES:
[H]C12CC(CC)C([H])(C1)C(C2)NC(C)=O
: