Target
Isoform 2 of Nuclear receptor ROR-alpha (Alpha-2)
Ligand
BDBM39518
Substrate
Meas. Tech.
Dose-response cell-based assay for activators of the Retinoic Acid Receptor-related orphan receptor A (RORA)
EC50
4339±n/a nM
Citation
 PubChem, PC Dose-response cell-based assay for activators of the Retinoic Acid Receptor-related orphan receptor A (RORA) PubChem Bioassay (2007)[AID] 
Target
Name:
Isoform 2 of Nuclear receptor ROR-alpha (Alpha-2)
Synonyms:
NR1F1 Nuclear receptor ROR-alpha (Alpha-2) RORA RZRA
Type:
PROTEIN
Mol. Mass.:
63033.59
Organism:
Homo sapiens (Human)
Description:
EBI_101591
Residue:
556
  
Inhibitor
Name:
BDBM39518
Synonyms:
2-furanyl-[4-(3-phenyl-7-isothiazolo[4,5-d]pyrimidinyl)-1-piperazinyl]methanone Furan-2-yl-[4-(3-phenyl-isothiazolo[4,5-d]pyrimidin-7-yl)-piperazin-1-yl]-methanone SMR000006420 furan-2-yl-[4-(3-phenyl-[1,2]thiazolo[4,5-d]pyrimidin-7-yl)piperazin-1-yl]methanone
Type:
Small organic molecule
Emp. Form.:
C20H17N5O2S
Mol. Mass.:
391.446
SMILES:
O=C(N1CCN(CC1)c1ncnc2c(nsc12)-c1ccccc1)c1ccco1
: