Target
Isoform 2 of Nuclear receptor ROR-alpha (Alpha-2)
Ligand
BDBM39561
Substrate
Meas. Tech.
Dose-response cell-based assay for activators of the Retinoic Acid Receptor-related orphan receptor A (RORA)
EC50
>11000±n/a nM
Citation
 PubChem, PC Dose-response cell-based assay for activators of the Retinoic Acid Receptor-related orphan receptor A (RORA) PubChem Bioassay (2007)[AID] 
Target
Name:
Isoform 2 of Nuclear receptor ROR-alpha (Alpha-2)
Synonyms:
NR1F1 Nuclear receptor ROR-alpha (Alpha-2) RORA RZRA
Type:
PROTEIN
Mol. Mass.:
63033.59
Organism:
Homo sapiens (Human)
Description:
EBI_101591
Residue:
556
  
Inhibitor
Name:
BDBM39561
Synonyms:
4-chloranyl-3-methyl-N-[1-[(2-methylphenyl)methyl]pyrazol-3-yl]-1,2-oxazole-5-carboxamide 4-chloro-3-methyl-N-[1-[(2-methylphenyl)methyl]-3-pyrazolyl]-5-isoxazolecarboxamide MLS000118393 cid_5308958
Type:
Small organic molecule
Emp. Form.:
C16H15ClN4O2
Mol. Mass.:
330.769
SMILES:
Cc1noc(C(=O)Nc2ccn(Cc3ccccc3C)n2)c1Cl
: