Target
Alkaline phosphatase, germ cell type
Ligand
BDBM39607
Substrate
Meas. Tech.
Luminescent assay for HTS discovery of chemical inhibitors of placental alkaline phosphatase
IC50
10300±600 nM
Citation
 PubChem, PC Luminescent assay for HTS discovery of chemical inhibitors of placental alkaline phosphatase PubChem Bioassay (2007)[AID] 
Target
Name:
Alkaline phosphatase, germ cell type
Synonyms:
ALPG ALPPL2 PPBN_HUMAN | placental-like alkaline phosphatase preproprotein
Type:
PROTEIN
Mol. Mass.:
57374.31
Organism:
Homo sapiens (Human)
Description:
ChEMBL_29964
Residue:
532
  
Inhibitor
Name:
BDBM39607
Synonyms:
2-(5-bromanylfuran-2-yl)-5-(3,4-dimethoxyphenyl)-1,3,4-oxadiazole 2-(5-bromo-2-furyl)-5-(3,4-dimethoxyphenyl)-1,3,4-oxadiazole MLS000056595 cid_1219876
Type:
Small organic molecule
Emp. Form.:
C14H11BrN2O4
Mol. Mass.:
351.152
SMILES:
COc1ccc(cc1OC)-c1nnc(o1)-c1ccc(Br)o1
: