Target
Steroidogenic factor 1
Ligand
BDBM39419
Substrate
Meas. Tech.
Dose-response cell-based assay for activators of the nuclear receptor Steroidogenic Factor 1 (SF-1)
EC50
9843±n/a nM
Citation
 PubChem, PC Dose-response cell-based assay for activators of the nuclear receptor Steroidogenic Factor 1 (SF-1) PubChem Bioassay (2007)[AID] 
Target
Name:
Steroidogenic factor 1
Synonyms:
AD4BP FTZF1 NR5A1 SF-1 STF-1 Steroid hormone receptor Ad4BP
Type:
Nuclear Hormone Receptor
Mol. Mass.:
51643.43
Organism:
Homo sapiens (Human)
Description:
Residue:
461
  
Inhibitor
Name:
BDBM39419
Synonyms:
2-(4-Ethyl-5-furan-2-yl-4H-[1,2,4]triazol-3-ylsulfanyl)-1-thiophen-2-yl-ethanone 2-[[4-ethyl-5-(2-furyl)-1,2,4-triazol-3-yl]thio]-1-(2-thienyl)ethanone 2-[[4-ethyl-5-(furan-2-yl)-1,2,4-triazol-3-yl]sulfanyl]-1-thiophen-2-ylethanone SMR000006145 | cid_644745
Type:
Small organic molecule
Emp. Form.:
C14H13N3O2S2
Mol. Mass.:
319.402
SMILES:
CCn1c(SCC(=O)c2cccs2)nnc1-c1ccco1
: