Target
Steroidogenic factor 1
Ligand
BDBM39445
Substrate
Meas. Tech.
Dose-response cell-based assay for activators of the nuclear receptor Steroidogenic Factor 1 (SF-1)
EC50
>3667±n/a nM
Citation
 PubChem, PC Dose-response cell-based assay for activators of the nuclear receptor Steroidogenic Factor 1 (SF-1) PubChem Bioassay (2007)[AID] 
Target
Name:
Steroidogenic factor 1
Synonyms:
AD4BP FTZF1 NR5A1 SF-1 STF-1 Steroid hormone receptor Ad4BP
Type:
Nuclear Hormone Receptor
Mol. Mass.:
51643.43
Organism:
Homo sapiens (Human)
Description:
Residue:
461
  
Inhibitor
Name:
BDBM39445
Synonyms:
2-[[6-(1,3-benzodioxol-5-yl)-3-cyano-2-pyridinyl]thio]acetic acid ethyl ester MLS000036921 cid_660388 ethyl 2-[6-(1,3-benzodioxol-5-yl)-3-cyanopyridin-2-yl]sulfanylacetate
Type:
Small organic molecule
Emp. Form.:
C17H14N2O4S
Mol. Mass.:
342.369
SMILES:
CCOC(=O)CSc1nc(ccc1C#N)-c1ccc2OCOc2c1
: