Target
Steroidogenic factor 1
Ligand
BDBM39449
Substrate
Meas. Tech.
Dose-response cell-based assay for activators of the nuclear receptor Steroidogenic Factor 1 (SF-1)
EC50
434±n/a nM
Citation
 PubChem, PC Dose-response cell-based assay for activators of the nuclear receptor Steroidogenic Factor 1 (SF-1) PubChem Bioassay (2007)[AID] 
Target
Name:
Steroidogenic factor 1
Synonyms:
AD4BP FTZF1 NR5A1 SF-1 STF-1 Steroid hormone receptor Ad4BP
Type:
Nuclear Hormone Receptor
Mol. Mass.:
51643.43
Organism:
Homo sapiens (Human)
Description:
Residue:
461
  
Inhibitor
Name:
BDBM39449
Synonyms:
2-[2-[[1-(4-chlorophenyl)-4-pyrazolo[3,4-d]pyrimidinyl]amino]ethoxy]ethanol MLS000077465 cid_661110
Type:
Small organic molecule
Emp. Form.:
C15H16ClN5O2
Mol. Mass.:
333.773
SMILES:
OCCOCCNc1ncnc2n(ncc12)-c1ccc(Cl)cc1
: