Target
Steroidogenic factor 1
Ligand
BDBM39462
Substrate
Meas. Tech.
Dose-response cell-based assay for activators of the nuclear receptor Steroidogenic Factor 1 (SF-1)
EC50
1187±n/a nM
Citation
 PubChem, PC Dose-response cell-based assay for activators of the nuclear receptor Steroidogenic Factor 1 (SF-1) PubChem Bioassay (2007)[AID] 
Target
Name:
Steroidogenic factor 1
Synonyms:
AD4BP FTZF1 NR5A1 SF-1 STF-1 Steroid hormone receptor Ad4BP
Type:
Nuclear Hormone Receptor
Mol. Mass.:
51643.43
Organism:
Homo sapiens (Human)
Description:
Residue:
461
  
Inhibitor
Name:
BDBM39462
Synonyms:
MLS000053249 N-(4-imidazo[2,1-b]thiazol-6-ylphenyl)cyclopropanecarboxamide SMR000067558 | cid_2998122
Type:
Small organic molecule
Emp. Form.:
C15H13N3OS
Mol. Mass.:
283.348
SMILES:
O=C(Nc1ccc(cc1)-c1cn2ccsc2n1)C1CC1
: