Target
Steroidogenic factor 1
Ligand
BDBM38393
Substrate
Meas. Tech.
Dose-response cell-based assay for activators of the nuclear receptor Steroidogenic Factor 1 (SF-1)
EC50
>99000±n/a nM
Citation
 PubChem, PC Dose-response cell-based assay for activators of the nuclear receptor Steroidogenic Factor 1 (SF-1) PubChem Bioassay (2007)[AID] 
Target
Name:
Steroidogenic factor 1
Synonyms:
AD4BP FTZF1 NR5A1 SF-1 STF-1 Steroid hormone receptor Ad4BP
Type:
Nuclear Hormone Receptor
Mol. Mass.:
51643.43
Organism:
Homo sapiens (Human)
Description:
Residue:
461
  
Inhibitor
Name:
BDBM38393
Synonyms:
MLS000046703 N-(oxolan-2-ylmethyl)furo[3,2-b]quinoxaline-3-carboxamide N-(tetrahydrofurfuryl)furo[3,2-b]quinoxaline-3-carboxamide cid_3237531
Type:
Small organic molecule
Emp. Form.:
C16H15N3O3
Mol. Mass.:
297.3086
SMILES:
O=C(NCC1CCCO1)c1coc2nc3ccccc3nc12
: