Target
Steroidogenic factor 1
Ligand
BDBM39483
Substrate
Meas. Tech.
Dose-response cell-based assay for activators of the nuclear receptor Steroidogenic Factor 1 (SF-1)
EC50
>1222±n/a nM
Citation
 PubChem, PC Dose-response cell-based assay for activators of the nuclear receptor Steroidogenic Factor 1 (SF-1) PubChem Bioassay (2007)[AID] 
Target
Name:
Steroidogenic factor 1
Synonyms:
AD4BP FTZF1 NR5A1 SF-1 STF-1 Steroid hormone receptor Ad4BP
Type:
Nuclear Hormone Receptor
Mol. Mass.:
51643.43
Organism:
Homo sapiens (Human)
Description:
Residue:
461
  
Inhibitor
Name:
BDBM39483
Synonyms:
7-methoxy-N-(1-methoxypropan-2-yl)-4,5-dihydrobenzo[g][1,2]benzoxazole-3-carboxamide 7-methoxy-N-(2-methoxy-1-methylethyl)-4,5-dihydronaphtho[2,1-d]isoxazole-3-carboxamide SMR000023670 | cid_3244320
Type:
Small organic molecule
Emp. Form.:
C17H20N2O4
Mol. Mass.:
316.3517
SMILES:
COCC(C)NC(=O)c1noc-2c1CCc1cc(OC)ccc-21
: